Target
Adenosine deaminase
Ligand
BDBM22926
Substrate
BDBM14487
Meas. Tech.
ADA Inhibition Assay
pH
7.4±n/a
Temperature
295.15±n/a K
Ki
37±n/a nM
Citation
 Terasaka, TNakanishi, INakamura, KEikyu, YKinoshita, TNishio, NSato, AKuno, MSeki, NSakane, K Structure-based de novo design of non-nucleoside adenosine deaminase inhibitors. Bioorg Med Chem Lett 13:1115-8 (2003)  
Target
Name:
Adenosine deaminase
Synonyms:
ADA ADA_HUMAN | Adenosine aminohydrolase
Type:
Enzyme
Mol. Mass.:
40759.44
Organism:
Homo sapiens (Human)
Description:
Human recombinant ADA was expressed and purified from an ADA-deficient bacterial strain.
Residue:
363
  
Inhibitor
Name:
BDBM22926
Synonyms:
3-(6-amino-9H-purin-9-yl)nonan-2-ol Erythro-9-(2-hydroxy-3-nonyl)adenine
Type:
Small organic molecule
Emp. Form.:
C14H23N5O
Mol. Mass.:
277.3653
SMILES:
CCCCCCC(C(C)O)n1cnc2c(N)ncnc12
:
Substrate
Name:
BDBM14487
Synonyms:
(2R,3R,4S,5R)-2-(6-amino-9H-purin-9-yl)-5-(hydroxymethyl)oxolane-3,4-diol Adenosine N6-Methylado cid_191 | cid_60961
Type:
Nucleoside or nucleotide
Emp. Form.:
C10H13N5O4
Mol. Mass.:
267.2413
SMILES:
Nc1ncnc2n(cnc12)[C@@H]1O[C@H](CO)[C@@H](O)[C@H]1O
: