Target
Adenosine deaminase
Ligand
BDBM22928
Substrate
BDBM14487
Meas. Tech.
ADA Inhibition Assay
pH
7.4±n/a
Temperature
295.15±n/a K
Ki
24±n/a nM
Citation
 Terasaka, TKinoshita, TKuno, MSeki, NTanaka, KNakanishi, I Structure-based design, synthesis, and structure-activity relationship studies of novel non-nucleoside adenosine deaminase inhibitors. J Med Chem 47:3730-43 (2004)  
Target
Name:
Adenosine deaminase
Synonyms:
ADA ADA_HUMAN | Adenosine aminohydrolase
Type:
Enzyme
Mol. Mass.:
40759.44
Organism:
Homo sapiens (Human)
Description:
Human recombinant ADA was expressed and purified from an ADA-deficient bacterial strain.
Residue:
363
  
Inhibitor
Name:
BDBM22928
Synonyms:
1-[(2R)-4-(6-hexanamido-1H-indol-1-yl)-1-hydroxybutan-2-yl]-1H-imidazole-4-carboxamide | Hybrid compound 1(FR235999) derivative, 4b
Type:
Small organic molecule
Emp. Form.:
C22H29N5O3
Mol. Mass.:
411.4974
SMILES:
CCCCCC(=O)Nc1ccc2ccn(CC[C@H](CO)n3cnc(c3)C(N)=O)c2c1
:
Substrate
Name:
BDBM14487
Synonyms:
(2R,3R,4S,5R)-2-(6-amino-9H-purin-9-yl)-5-(hydroxymethyl)oxolane-3,4-diol Adenosine N6-Methylado cid_191 | cid_60961
Type:
Nucleoside or nucleotide
Emp. Form.:
C10H13N5O4
Mol. Mass.:
267.2413
SMILES:
Nc1ncnc2n(cnc12)[C@@H]1O[C@H](CO)[C@@H](O)[C@H]1O
: