Target
Fatty-acid amide hydrolase 1 [30-579]
Ligand
BDBM22992
Substrate
BDBM22988
Meas. Tech.
FAAH Inhibition Assay
pH
9±n/a
Temperature
310.15±n/a K
IC50
>50000±n/a nM
Citation
 Ortar, GCascio, MGDe Petrocellis, LMorera, ERossi, FSchiano-Moriello, ANalli, Mde Novellis, VWoodward, DFMaione, SDi Marzo, V New N-arachidonoylserotonin analogues with potential "dual" mechanism of action against pain. J Med Chem 50:6554-69 (2007)  
Target
Name:
Fatty-acid amide hydrolase 1 [30-579]
Synonyms:
Anandamide amidohydrolase 1 Faah Fatty Acid Amide Hydrolase Fatty-acid amide hydrolase (FAAH) Fatty-acid amide hydrolase 1 (FAAH) Oleamide hydrolase 1
Type:
Single-pass membrane protein; homodimer
Mol. Mass.:
60474.00
Organism:
Rattus norvegicus (rat)
Description:
P97612 (aa 30-579)
Residue:
550
  
Inhibitor
Name:
BDBM22992
Synonyms:
(9Z)-N-[2-(5-hydroxy-1H-indol-3-yl)ethyl]octadec-9-enamide | N-arachidonoylserotonin analogue, 1e
Type:
Small organic molecule
Emp. Form.:
C28H44N2O2
Mol. Mass.:
440.6612
SMILES:
CCCCCCCC\C=C/CCCCCCCC(=O)NCCc1c[nH]c2ccc(O)cc12
:
Substrate
Name:
BDBM22988
Synonyms:
(5Z,8Z,11Z,14Z)-N-(2-hydroxyethyl)icosa-5,8,11,14-tetraenamide ANANDAMIDE Arachidonoyl ethanolamide (AEA) Arachidonylethanolamide [14C]Anandamide | [3H]Anandamide
Type:
radiolabeled substrate
Emp. Form.:
C22H37NO2
Mol. Mass.:
347.5347
SMILES:
CCCCC\C=C/C\C=C/C\C=C/C\C=C/CCCC(=O)NCCO
: