Target
Inhibitor of nuclear factor kappa-B kinase subunit epsilon
Ligand
BDBM278157
Substrate
Meas. Tech.
Biological Assays for TBK1 and IKKe
IC50
3.00±n/a nM
Citation
 Du, ZGuerrero, JAKaplan, JAKnox, Jr., JELo, JRMitchell, SANaduthambi, DPhillips, BWVenkataramani, CWang, PWatkins, WJZhao, Z Tank-binding kinase inhibitor compounds US Patent  US10253019 Publication Date 4/9/2019 
Target
Name:
Inhibitor of nuclear factor kappa-B kinase subunit epsilon
Synonyms:
I kappa-B kinase epsilon I-kappa-B kinase epsilon (IKK-E) IKBKE IKK-epsilon IKKE IKKI KIAA0151 | von Hippel-Lindau disease tumor suppressor/Inhibitor of nuclear factor kappa-B kinase subunit epsilon
Type:
Serine/threonine-protein kinase
Mol. Mass.:
80475.98
Organism:
Homo sapiens (Human)
Description:
Kinase inhibitory activity was determined using recombinant human IKK-epsilon expressed in baculovirus as a FLAG-tagged fusion protein.
Residue:
716
  
Inhibitor
Name:
BDBM278157
Synonyms:
2-(((3R,4S)-3-fluoro-1-((S)-2-hydroxypropanoyl)piperidin-4-yl)oxy)-5-(4-((6-(4-(oxetan-3-yl)piperazin-1-yl)pyridin-3-yl)amino)-1,3,5-triazin-2-yl)benzonitrile US10253019, Example 379
Type:
Small organic molecule
Emp. Form.:
C30H34FN9O4
Mol. Mass.:
603.6473
SMILES:
C[C@H](O)C(=O)N1CC[C@H](Oc2ccc(cc2C#N)-c2ncnc(Nc3ccc(nc3)N3CCN(CC3)C3COC3)n2)[C@H](F)C1
: