Target
Carboxylic ester hydrolase
Ligand
BDBM23029
Substrate
BDBM23139
Meas. Tech.
FAAH Inhibition Assay
Temperature
298.15±n/a K
IC50
800±n/a nM
Comments
extracted
Citation
 Hardouin, CKelso, MJRomero, FARayl, TJLeung, DHwang, ICravatt, BFBoger, DL Structure-activity relationships of alpha-ketooxazole inhibitors of fatty acid amide hydrolase. J Med Chem 50:3359-68 (2007)  
Target
Name:
Carboxylic ester hydrolase
Synonyms:
Carboxylesterase 3 precursor Triacylglycerol Hydrolase
Type:
Homotrimer; type-B carboxylesterase/lipase family
Mol. Mass.:
61960.20
Organism:
Homo sapiens (Human)
Description:
Q8TDZ9
Residue:
565
  
Inhibitor
Name:
BDBM23029
Synonyms:
1-[5-(pyridin-2-yl)-1,3-oxazol-2-yl]-7-(thiophen-3-yl)heptan-1-one | alpha-ketooxazole, 5b
Type:
Small organic molecule
Emp. Form.:
C19H20N2O2S
Mol. Mass.:
340.439
SMILES:
O=C(CCCCCCc1ccsc1)c1ncc(o1)-c1ccccn1
:
Substrate
Name:
BDBM23139
Synonyms:
4-Nitrophenyl dodecanoate p-Nitrophenyl laurate
Type:
Emp. Form.:
C18H27NO4
Mol. Mass.:
321.4113
SMILES:
CCCCCCCCCCCC(=O)Oc1ccc(cc1)[N+]([O-])=O
: