Target
Malate dehydrogenase, cytoplasmic
Ligand
BDBM23224
Substrate
BDBM23230
Meas. Tech.
Lactate Dehydrogenase Inhibition Assay
IC50
>232000±n/a nM
Citation
 Choi, SRPradhan, AHammond, NLChittiboyina, AGTekwani, BLAvery, MA Design, synthesis, and biological evaluation of Plasmodium falciparum lactate dehydrogenase inhibitors. J Med Chem 50:3841-50 (2007)  
Target
Name:
Malate dehydrogenase, cytoplasmic
Synonyms:
Cytosolic malate dehydrogenase MDHC_PIG Malate dehydrogenase cytoplasmic
Type:
Oxidoreductase; homodimer
Mol. Mass.:
36453.77
Organism:
Sus scrofa (pig)
Description:
Porcine heart cytoplasmic fraction.
Residue:
334
  
Inhibitor
Name:
BDBM23224
Synonyms:
7-{[4-(formamidoformic acid)-3-methoxyphenyl]methoxy}-5-hydroxy-4-oxo-4H-chromene-2-carboxylic acid | Oxamic acid derivative, 1
Type:
Small organic molecule
Emp. Form.:
C20H15NO10
Mol. Mass.:
429.3338
SMILES:
COc1cc(COc2cc(O)c3c(c2)oc(cc3=O)C(O)=O)ccc1NC(=O)C(O)=O
:
Substrate
Name:
BDBM23230
Synonyms:
2-Oxosuccinic acid Oxaloacetate keto-Oxaloacetate
Type:
Small organic molecule
Emp. Form.:
C4H4O5
Mol. Mass.:
132.0716
SMILES:
OC(=O)CC(=O)C(O)=O
: