Target
Beta-secretase 1 [1-460]
Ligand
BDBM136830
Substrate
Meas. Tech.
FRET Assay
IC50
2.00±n/a nM
Citation
 Csjernyik, GKarlstrom, SKers, AKolmodin, KNylof, MOhberg, LRakos, LSandberg, LSehgelmeble, FSoderman, PSwahn, BVon Berg, S Compounds and their use as BACE inhibitors US Patent  US9918985 Publication Date 3/20/2018 
Target
Name:
Beta-secretase 1 [1-460]
Synonyms:
BACE BACE1_HUMAN Beta-secretase 1 (aa 1-460) | KIAA1149
Type:
Protein
Mol. Mass.:
50987.78
Organism:
Homo sapiens (Human)
Description:
P56817[1-460]
Residue:
460
  
Inhibitor
Name:
BDBM136830
Synonyms:
US10231967, Example 67 US8865911, 68 Isomer 1 | US9918985, Example 68 Isomer 2
Type:
Small organic molecule
Emp. Form.:
C27H30N4O
Mol. Mass.:
426.5533
SMILES:
CCC1=NC2(N=C1N)c1cc(ccc1C[C@@]21CC[C@@H](CC1)OC)-c1cncc(c1)C#CC
: