Target
Beta-secretase 1 [1-460]
Ligand
BDBM136834
Substrate
Meas. Tech.
FRET Assay
IC50
2.60±n/a nM
Citation
 Csjernyik, GKarlstrom, SKers, AKolmodin, KNylof, MOhberg, LRakos, LSandberg, LSehgelmeble, FSoderman, PSwahn, BVon Berg, S Compounds and their use as BACE inhibitors US Patent  US9918985 Publication Date 3/20/2018 
Target
Name:
Beta-secretase 1 [1-460]
Synonyms:
BACE BACE1_HUMAN Beta-secretase 1 (aa 1-460) | KIAA1149
Type:
Protein
Mol. Mass.:
50987.78
Organism:
Homo sapiens (Human)
Description:
P56817[1-460]
Residue:
460
  
Inhibitor
Name:
BDBM136834
Synonyms:
US8865911, 74 | US9918985, Example 74
Type:
Small organic molecule
Emp. Form.:
C26H28N4O
Mol. Mass.:
412.5267
SMILES:
CO[C@H]1CC[C@@]2(Cc3ccc(cc3C22N=C(C)C(N)=N2)-c2cc(C)cc(c2)C#N)CC1
: