Target
Alpha-glucosidase MAL32
Ligand
BDBM23839
Substrate
BDBM23837
Meas. Tech.
alpha-Glucosidase Inhibition Assay
pH
7±n/a
Temperature
310.15±n/a K
IC50
9900±n/a nM
Citation
 Dodo, KAoyama, ANoguchi-Yachide, TMakishima, MMiyachi, HHashimoto, Y Co-existence of alpha-glucosidase-inhibitory and liver X receptor-regulatory activities and their separation by structural development. Bioorg Med Chem 16:4272-85 (2008)  
Target
Name:
Alpha-glucosidase MAL32
Synonyms:
Alpha-glucosidase MAL32 MAL32_YEAST Maltase alpha-Glucosidase (alpha-Glu) | alpha-Glucosidase (α-Glucosidase)
Type:
Hydrolase
Mol. Mass.:
68132.36
Organism:
Saccharomyces cerevisiae
Description:
Purchased from Wako Fine Chemicals Co. Ltd.
Residue:
584
  
Inhibitor
Name:
BDBM23839
Synonyms:
14-oxapentacyclo[20.2.2.2^{10,13}.1^{15,19}.0^{2,7}]nonacosa-1(25),2(7),3,5,10,12,15,17,19(27),22(26),23,28-dodecaene-5,16,24-triol | Riccardin C
Type:
Small organic molecule
Emp. Form.:
C28H24O4
Mol. Mass.:
424.4878
SMILES:
Oc1ccc-2c(CCc3ccc(Oc4cc(CCc5ccc-2c(O)c5)ccc4O)cc3)c1
:
Substrate
Name:
BDBM23837
Synonyms:
(2R,3S,4S,5R,6R)-2-(hydroxymethyl)-6-(4-nitrophenoxy)oxane-3,4,5-triol p-NPG pNPG
Type:
Chromogenic substrate
Emp. Form.:
C12H15NO8
Mol. Mass.:
301.2494
SMILES:
OC[C@H]1O[C@H](Oc2ccc(cc2)[N+]([O-])=O)[C@H](O)[C@@H](O)[C@@H]1O
: