Target
Suppressor of tumorigenicity 14 protein
Ligand
BDBM23880
Substrate
BDBM23868
Meas. Tech.
Determination of Inhibition Constants
pH
8±n/a
Temperature
298.15±n/a K
Ki
210±n/a nM
Citation
 Steinmetzer, TSchweinitz, AStürzebecher, ADönnecke, DUhland, KSchuster, OSteinmetzer, PMüller, FFriedrich, RThan, MEBode, WStürzebecher, J Secondary amides of sulfonylated 3-amidinophenylalanine. New potent and selective inhibitors of matriptase. J Med Chem 49:4116-26 (2006)  
Target
Name:
Suppressor of tumorigenicity 14 protein
Synonyms:
Epithin MT-SP1 PRSS14 SNC19 ST14_HUMAN Suppressor of tumorigenicity 14 protein TADG15
Type:
Single-pass type II membrane protein
Mol. Mass.:
94769.23
Organism:
Homo sapiens (Human)
Description:
Q9Y5Y6
Residue:
855
  
Inhibitor
Name:
BDBM23880
Synonyms:
3-[(2S)-3-[4-(3-carbamimidamidopropanoyl)piperazin-1-yl]-2-(naphthalene-2-sulfonamido)-3-oxopropyl]benzene-1-carboximidamide | 3-amidinophenylalanine deriv., 24
Type:
Small organic molecule
Emp. Form.:
C28H34N8O4S
Mol. Mass.:
578.686
SMILES:
[#7]\[#6](-[#7])=[#7]/[#6]-[#6]-[#6](=O)-[#7]-1-[#6]-[#6]-[#7](-[#6]-[#6]-1)-[#6](=O)-[#6@H](-[#6]-c1cccc(c1)-[#6](-[#7])=[#7])-[#7]S(=O)(=O)c1ccc2ccccc2c1
:
Substrate
Name:
BDBM23868
Synonyms:
(2S)-5-carbamimidamido-2-{2-[(2R)-3-(4-hydroxycyclohexyl)-2-methanesulfonamidopropanamido]acetamido}-N-(4-nitrophenyl)pentanamide Pefachrome tPA
Type:
chromogenic substrate
Emp. Form.:
C24H38N8O8S
Mol. Mass.:
598.672
SMILES:
CS(=O)(=O)NC(CC1CCC(O)CC1)C(=O)NCC(=O)NC(CCC\[NH+]=C(/N)[NH-])C(=O)Nc1ccc(cc1)[N+]([O-])=O
: