Target
Urokinase-type plasminogen activator
Ligand
BDBM23882
Substrate
BDBM23922
Meas. Tech.
Determination of Inhibition Constants
Ki
19000±n/a nM
Citation
 Steinmetzer, TSchweinitz, AStürzebecher, ADönnecke, DUhland, KSchuster, OSteinmetzer, PMüller, FFriedrich, RThan, MEBode, WStürzebecher, J Secondary amides of sulfonylated 3-amidinophenylalanine. New potent and selective inhibitors of matriptase. J Med Chem 49:4116-26 (2006)  
Target
Name:
Urokinase-type plasminogen activator
Synonyms:
PLAU UROK_HUMAN Urokinase-type plasminogen activator (uPA) | Urokinase-type plasminogen activator/surface receptor
Type:
Enzyme
Mol. Mass.:
48528.62
Organism:
Homo sapiens (Human)
Description:
P00749
Residue:
431
  
Inhibitor
Name:
BDBM23882
Synonyms:
3-[(2S)-3-[4-(3-carbamimidamidopropanoyl)piperazin-1-yl]-2-(naphthalene-1-sulfonamido)-3-oxopropyl]benzene-1-carboximidamide | 3-amidinophenylalanine deriv., 26
Type:
Small organic molecule
Emp. Form.:
C28H34N8O4S
Mol. Mass.:
578.686
SMILES:
[#7]\[#6](-[#7])=[#7]/[#6]-[#6]-[#6](=O)-[#7]-1-[#6]-[#6]-[#7](-[#6]-[#6]-1)-[#6](=O)-[#6@H](-[#6]-c1cccc(c1)-[#6](-[#7])=[#7])-[#7]S(=O)(=O)c1cccc2ccccc12
:
Substrate
Name:
BDBM23922
Synonyms:
Bz-beta-Ala-Gly-Arg-pNA | benzoyl-beta-Ala-Gly-Arg-p-nitroanilide
Type:
Emp. Form.:
Mol. Mass.:
SMILES:
: