Target
Prothrombin
Ligand
BDBM23880
Substrate
BDBM23924
Meas. Tech.
Determination of Inhibition Constants
Ki
1400±n/a nM
Citation
 Steinmetzer, TSchweinitz, AStürzebecher, ADönnecke, DUhland, KSchuster, OSteinmetzer, PMüller, FFriedrich, RThan, MEBode, WStürzebecher, J Secondary amides of sulfonylated 3-amidinophenylalanine. New potent and selective inhibitors of matriptase. J Med Chem 49:4116-26 (2006)  
Target
Name:
Prothrombin
Synonyms:
Activation peptide fragment 1 Coagulation factor II Prothrombin Thrombin Thrombin light chain
Type:
Enzyme
Mol. Mass.:
70502.73
Organism:
Bos taurus (Bovine)
Description:
P00735
Residue:
625
  
Inhibitor
Name:
BDBM23880
Synonyms:
3-[(2S)-3-[4-(3-carbamimidamidopropanoyl)piperazin-1-yl]-2-(naphthalene-2-sulfonamido)-3-oxopropyl]benzene-1-carboximidamide | 3-amidinophenylalanine deriv., 24
Type:
Small organic molecule
Emp. Form.:
C28H34N8O4S
Mol. Mass.:
578.686
SMILES:
[#7]\[#6](-[#7])=[#7]/[#6]-[#6]-[#6](=O)-[#7]-1-[#6]-[#6]-[#7](-[#6]-[#6]-1)-[#6](=O)-[#6@H](-[#6]-c1cccc(c1)-[#6](-[#7])=[#7])-[#7]S(=O)(=O)c1ccc2ccccc2c1
:
Substrate
Name:
BDBM23924
Synonyms:
MeSO2-D-hexahydrotyrosyl-Gly-Arg-p-nitroanilide | MeSO2-D-hexahydrotyrosyl-Gly-Arg-pNA
Type:
Emp. Form.:
Mol. Mass.:
SMILES:
: