Target
Coagulation factor X
Ligand
BDBM23902
Substrate
BDBM23925
Meas. Tech.
Determination of Inhibition Constants
Ki
27000±n/a nM
Citation
 Steinmetzer, TSchweinitz, AStürzebecher, ADönnecke, DUhland, KSchuster, OSteinmetzer, PMüller, FFriedrich, RThan, MEBode, WStürzebecher, J Secondary amides of sulfonylated 3-amidinophenylalanine. New potent and selective inhibitors of matriptase. J Med Chem 49:4116-26 (2006)  
Target
Name:
Coagulation factor X
Synonyms:
Coagulation factor X FA10_BOVIN | Factor Xa (fXa)
Type:
PROTEIN
Mol. Mass.:
54498.45
Organism:
Bos taurus
Description:
ChEMBL_1364435
Residue:
492
  
Inhibitor
Name:
BDBM23902
Synonyms:
3-[(2S)-3-[4-(2-carbamimidamidoethyl)piperidin-1-yl]-2-(naphthalene-2-sulfonamido)-3-oxopropyl]benzene-1-carboximidamide | 3-amidinophenylalanine deriv., 8
Type:
Small organic molecule
Emp. Form.:
C28H35N7O3S
Mol. Mass.:
549.688
SMILES:
[#7]\[#6](-[#7])=[#7]/[#6]-[#6]-[#6]-1-[#6]-[#6]-[#7](-[#6]-[#6]-1)-[#6](=O)-[#6@H](-[#6]-c1cccc(c1)-[#6](-[#7])=[#7])-[#7]S(=O)(=O)c1ccc2ccccc2c1
:
Substrate
Name:
BDBM23925
Synonyms:
MeSO2-D-Nle-Gly-Arg-p-nitroanilide | MeSO2-D-Nle-Gly-Arg-pNA
Type:
Emp. Form.:
Mol. Mass.:
SMILES:
: