Target
Aryl hydrocarbon receptor
Ligand
BDBM23940
Substrate
BDBM23927
Meas. Tech.
In Vitro Binding Assay
pH
7.6±n/a
Temperature
277.15±n/a K
Ki
75±3.2 nM
Comments
Antagonist.
Citation
 de Medina, PCasper, RSavouret, JFPoirot, M Synthesis and biological properties of new stilbene derivatives of resveratrol as new selective aryl hydrocarbon modulators. J Med Chem 48:287-91 (2005)  
Target
Name:
Aryl hydrocarbon receptor
Synonyms:
AHR Aryl Hydrocarbon Receptor (AhR) | Dioxin receptor
Type:
Transcription factor
Mol. Mass.:
94428.00
Organism:
Oryctolagus cuniculus (rabbit)
Description:
Cytosols from rabbit liver were used in binding assay.
Residue:
847
  
Inhibitor
Name:
BDBM23940
Synonyms:
1,3-dimethoxy-5-[(Z)-2-(4-methoxyphenyl)ethenyl]benzene cis-Stilbene Derivative, 5a
Type:
Small organic molecule
Emp. Form.:
C17H18O3
Mol. Mass.:
270.323
SMILES:
COc1ccc(\C=C/c2cc(OC)cc(OC)c2)cc1
:
Substrate
Name:
BDBM23927
Synonyms:
2,3,7,8-Tetrachlorodibenzo-p-dioxin Tetrachlorodibenzodioxin | [3H]-TCDD
Type:
radiolabeled ligand
Emp. Form.:
C12H4Cl4O2
Mol. Mass.:
321.971
SMILES:
Clc1cc2Oc3cc(Cl)c(Cl)cc3Oc2cc1Cl
: