Target
Leukotriene A-4 hydrolase
Ligand
BDBM23975
Substrate
BDBM23991
Meas. Tech.
Enzyme Inhibition Assay
IC50
>1000000±n/a nM
Citation
 Albrecht, SDefoin, ASalomon, ETarnus, CWetterholm, AHaeggström, JZ Synthesis and structure activity relationships of novel non-peptidic metallo-aminopeptidase inhibitors. Bioorg Med Chem 14:7241-57 (2006)  
Target
Name:
Leukotriene A-4 hydrolase
Synonyms:
LKHA4_HUMAN LTA4 Leukotriene A(4) hydrolase Leukotriene A4 hydrolase
Type:
Hydrolase; metalloprotease
Mol. Mass.:
69280.41
Organism:
Homo sapiens (Human)
Description:
Human recombinant LTA4H.
Residue:
611
  
Inhibitor
Name:
BDBM23975
Synonyms:
(3Z)-3-(methoxyimino)-1,2,3,4-tetrahydronaphthalen-2-amine hydrochloride | Tetralone-oxime derivative, 2b
Type:
Small organic molecule
Emp. Form.:
C11H14N2O
Mol. Mass.:
190.2417
SMILES:
CO\N=C1\Cc2ccccc2CC1N
:
Substrate
Name:
BDBM23991
Synonyms:
(2S)-2-amino-N-(4-nitrophenyl)propanamide Alanine para-nitroanilide | L-Alanine-4-nitroanilide
Type:
Emp. Form.:
C9H11N3O3
Mol. Mass.:
209.2019
SMILES:
C[C@H](N)C(=O)Nc1ccc(cc1)[N+]([O-])=O
: