Target
N-lysine methyltransferase SMYD2
Ligand
BDBM378686
Substrate
Meas. Tech.
SMYD2 Biochemical Assay
IC50
882±n/a nM
Citation
 Foley, MAKuntz, KWMills, JEMitchell, LHMunchhof, MJHarvey, DM Substituted 1,2,3-triazoles as SMYD inhibitors for treating cancer US Patent  US10266526 Publication Date 4/23/2019 
Target
Name:
N-lysine methyltransferase SMYD2
Synonyms:
HSKM-B KMT3C N-lysine methyltransferase SMYD2 SET and MYND domain-containing protein 2 (SMYD2) SMYD2_HUMAN
Type:
Enzyme
Mol. Mass.:
49689.57
Organism:
Homo sapiens (Human)
Description:
Q9NRG4
Residue:
433
  
Inhibitor
Name:
BDBM378686
Synonyms:
1-cyclopropyl-N-{1-[(4-hydroxyphenyl)methyl]azetidin-3-yl}-1H-1,2,3-triazole-4-carboxamide | US10266526, Compound 824
Type:
Small organic molecule
Emp. Form.:
C16H19N5O2
Mol. Mass.:
313.3544
SMILES:
Oc1ccc(CN2CC(C2)NC(=O)c2cn(nn2)C2CC2)cc1
: