Target
Potassium voltage-gated channel subfamily H member 2
Ligand
BDBM24104
Substrate
BDBM24064
Meas. Tech.
hERG Radioligand Competition Assay
pH
7.4±n/a
Temperature
295.15±n/a K
IC50
10000±n/a nM
Citation
 Roecker, AJColeman, PJMercer, SPSchreier, JDBuser, CAWalsh, ESHamilton, KLobell, RBTao, WDiehl, RESouth, VJDavide, JPKohl, NEYan, YKuo, LCLi, CFernandez-Metzler, CMahan, EAPrueksaritanont, THartman, GD Kinesin spindle protein (KSP) inhibitors. Part 8: Design and synthesis of 1,4-diaryl-4,5-dihydropyrazoles as potent inhibitors of the mitotic kinesin KSP. Bioorg Med Chem Lett 17:5677-82 (2007)  
Target
Name:
Potassium voltage-gated channel subfamily H member 2
Synonyms:
1,3-beta-glucan synthase component GLS2 ERG Eag-related protein 1 Ether-a-go-go-related gene (HERG) Ether-a-go-go-related gene potassium channel 1 Ether-a-go-go-related gene potassium channel 1 (hERG1) Ether-a-go-go-related protein 1 H-ERG KCNH2 Potassium voltage-gated channel subfamily H member 2 (hERG) Voltage-gated potassium channel subunit Kv11.1 hERG Potassium Channel 1 | putative potassium channel subunit
Type:
Multi-pass membrane protein
Mol. Mass.:
126672.65
Organism:
Homo sapiens (Human)
Description:
Q12809
Residue:
1159
  
Inhibitor
Name:
BDBM24104
Synonyms:
1-[(5R,6R)-5-[3-(4-acetylpiperazin-1-yl)propyl]-12-fluoro-5-phenyl-8-oxa-2,3-diazatricyclo[7.4.0.0^{2,6}]trideca-1(9),3,10,12-tetraen-4-yl]ethan-1-one dihydropyrazolobenzoxazine, 1
Type:
Small organic molecule
Emp. Form.:
C27H31FN4O3
Mol. Mass.:
478.5584
SMILES:
CC(=O)N1CCN(CCC[C@]2([C@@H]3COc4ccc(F)cc4N3N=C2C(C)=O)c2ccccc2)CC1
:
Substrate
Name:
BDBM24064
Synonyms:
L-706,000 MK-499 [35S]-MK499
Type:
radiolabeled ligand
Emp. Form.:
C25H29N3O4S
Mol. Mass.:
467.58
SMILES:
CS(=O)(=O)Nc1ccc2OC3(CCN(CC3)[C@@H]3CCc4cc(ccc4C3)C#N)C[C@@H](O)c2c1
: