Target
Histone-lysine N-methyltransferase EZH2
Ligand
BDBM378912
Substrate
Meas. Tech.
EZH2 enzymatic activity
IC50
1.000±n/a nM
Citation
 Marx, MALee, MRGalemmo, RABobinski, TP EZH2 inhibitors US Patent  US10266542 Publication Date 4/23/2019 
Target
Name:
Histone-lysine N-methyltransferase EZH2
Synonyms:
ENX-1 EZH2_HUMAN Histone-lysine N-methyltransferase EZH2 Lysine N-methyltransferase 6
Type:
Protein
Mol. Mass.:
85367.84
Organism:
Homo sapiens (Human)
Description:
Q15910
Residue:
746
  
Inhibitor
Name:
BDBM378912
Synonyms:
5,8-dichloro-7-[methoxy(oxetan-3-yl)methyl]-2-[(7-methyl-5-oxo-1,6-dihydropyrrolo[2,3-c]pyridin-4-yl)methyl]-3,4-dihydroisoquinolin-1-one | US10266542, Example 17
Type:
Small organic molecule
Emp. Form.:
C24H25Cl2N3O4
Mol. Mass.:
490.379
SMILES:
COC(C1COC1)c1cc(Cl)c2CCN(Cc3c4ccn(C)c4c(C)[nH]c3=O)C(=O)c2c1Cl
: