Target
Hepatocyte growth factor receptor
Ligand
BDBM24464
Substrate
biotinylated gastrin substrate
Meas. Tech.
HTRF Kinase Inhibition Assay
pH
7.4±n/a
Temperature
295.15±n/a K
Ki
1.3±n/a nM
Citation
 Liu, LSiegmund, AXi, NKaplan-Lefko, PRex, KChen, ALin, JMoriguchi, JBerry, LHuang, LTeffera, YYang, YZhang, YBellon, SFLee, MShimanovich, RBak, ADominguez, CNorman, MHHarmange, JCDussault, IKim, TS Discovery of a potent, selective, and orally bioavailable c-Met inhibitor: 1-(2-hydroxy-2-methylpropyl)-N-(5-(7-methoxyquinolin-4-yloxy)pyridin-2-yl)-5-methyl-3-oxo-2-phenyl-2,3-dihydro-1H-pyrazole-4-carboxamide (AMG 458). J Med Chem 51:3688-91 (2008)  
Target
Name:
Hepatocyte growth factor receptor
Synonyms:
Hepatocyte growth factor receptor Hepatocyte growth factor receptor (c-MET) MET Met proto-oncogene (hepatocyte growth factor receptor) Tyrosine-protein kinase Met (c-Met) c-Met kinase
Type:
Protein
Mol. Mass.:
155559.73
Organism:
Homo sapiens (Human)
Description:
P08581
Residue:
1390
  
Inhibitor
Name:
BDBM24464
Synonyms:
N-{3-fluoro-4-[(7-methoxyquinolin-4-yl)oxy]phenyl}-5-methyl-3-oxo-1-(2-oxopropyl)-2-phenyl-2,3-dihydro-1H-pyrazole-4-carboxamide | Substituted Pyrazolone, 6
Type:
Small organic molecule
Emp. Form.:
C30H25FN4O5
Mol. Mass.:
540.5417
SMILES:
COc1ccc2c(Oc3ccc(NC(=O)c4c(C)n(CC(C)=O)n(-c5ccccc5)c4=O)cc3F)ccnc2c1
:
Substrate
Name:
biotinylated gastrin substrate
Synonyms:
Type:
Peptide
Mol. Mass.:
2100.22
Organism:
Description:
Residue:
17
ITINYLEEEEAYGWLDF