Target
Hepatocyte growth factor receptor [1078-1345,V1092I,L1272V]
Ligand
BDBM24466
Substrate
biotinylated gastrin substrate
Meas. Tech.
HTRF Kinase Inhibition Assay
pH
7.4±n/a
Temperature
295.15±n/a K
Ki
1.1±n/a nM
Citation
 Liu, LSiegmund, AXi, NKaplan-Lefko, PRex, KChen, ALin, JMoriguchi, JBerry, LHuang, LTeffera, YYang, YZhang, YBellon, SFLee, MShimanovich, RBak, ADominguez, CNorman, MHHarmange, JCDussault, IKim, TS Discovery of a potent, selective, and orally bioavailable c-Met inhibitor: 1-(2-hydroxy-2-methylpropyl)-N-(5-(7-methoxyquinolin-4-yloxy)pyridin-2-yl)-5-methyl-3-oxo-2-phenyl-2,3-dihydro-1H-pyrazole-4-carboxamide (AMG 458). J Med Chem 51:3688-91 (2008)  
Target
Name:
Hepatocyte growth factor receptor [1078-1345,V1092I,L1272V]
Synonyms:
HGF/SF receptor MET_HUMAN SF receptor Tyrosine Kinase c-Met Mutant (V1092I) | c-Met
Type:
Tyrosine-protein kinase
Mol. Mass.:
30590.32
Organism:
Homo sapiens (Human)
Description:
P08581[1078-1345,V1092I,L1272V]
Residue:
268
  
Inhibitor
Name:
BDBM24466
Synonyms:
1-(2-hydroxy-2-methylpropyl)-N-{5-[(7-methoxyquinolin-4-yl)oxy]pyridin-2-yl}-5-methyl-3-oxo-2-phenyl-2,3-dihydro-1H-pyrazole-4-carboxamide | Substituted Pyrazolone, 17
Type:
Small organic molecule
Emp. Form.:
C30H29N5O5
Mol. Mass.:
539.5818
SMILES:
COc1ccc2c(Oc3ccc(NC(=O)c4c(C)n(CC(C)(C)O)n(-c5ccccc5)c4=O)nc3)ccnc2c1
:
Substrate
Name:
biotinylated gastrin substrate
Synonyms:
Type:
Peptide
Mol. Mass.:
2100.22
Organism:
Description:
Residue:
17
ITINYLEEEEAYGWLDF