Target
Hepatocyte growth factor receptor
Ligand
BDBM24477
Substrate
biotinylated gastrin substrate
Meas. Tech.
HTRF Kinase Inhibition Assay
pH
7.4±n/a
Temperature
295.15±n/a K
IC50
6±0.3 nM
Citation
 Albrecht, BKHarmange, JCBauer, DBerry, LBode, CBoezio, AAChen, AChoquette, DDussault, IFridrich, CHirai, SHoffman, DLarrow, JFKaplan-Lefko, PLin, JLohman, JLong, AMMoriguchi, JO'Connor, APotashman, MHReese, MRex, KSiegmund, AShah, KShimanovich, RSpringer, SKTeffera, YYang, YZhang, YBellon, SF Discovery and optimization of triazolopyridazines as potent and selective inhibitors of the c-Met kinase. J Med Chem 51:2879-82 (2008)  
Target
Name:
Hepatocyte growth factor receptor
Synonyms:
Hepatocyte growth factor receptor Hepatocyte growth factor receptor (c-MET) MET Met proto-oncogene (hepatocyte growth factor receptor) Tyrosine-protein kinase Met (c-Met) c-Met kinase
Type:
Protein
Mol. Mass.:
155559.73
Organism:
Homo sapiens (Human)
Description:
P08581
Residue:
1390
  
Inhibitor
Name:
BDBM24477
Synonyms:
4-(3-{[(7-methoxyquinolin-4-yl)oxy]methyl}-[1,2,4]triazolo[4,3-a]pyridazin-6-yl)-N-methylbenzamide | Triazolopyridazine, 10g
Type:
Small organic molecule
Emp. Form.:
C24H20N6O3
Mol. Mass.:
440.454
SMILES:
CNC(=O)c1ccc(cc1)-c1ccc2nnc(COc3ccnc4cc(OC)ccc34)n2n1
:
Substrate
Name:
biotinylated gastrin substrate
Synonyms:
Type:
Peptide
Mol. Mass.:
2100.22
Organism:
Description:
Residue:
17
ITINYLEEEEAYGWLDF