Target
Vascular endothelial growth factor receptor 2
Ligand
BDBM24497
Substrate
poly(Glu4, Tyr)
Meas. Tech.
In Vitro Kinase Assay
IC50
344±n/a nM
Citation
 Claridge, SRaeppel, FGranger, MCBernstein, NSaavedra, OZhan, LLlewellyn, DWahhab, ADeziel, RRahil, JBeaulieu, NNguyen, HDupont, IBarsalou, ABeaulieu, CChute, IGravel, SRobert, MFLefebvre, SDubay, MPascal, RGillespie, JJin, ZWang, JBesterman, JMMacLeod, ARVaisburg, A Discovery of a novel and potent series of thieno[3,2-b]pyridine-based inhibitors of c-Met and VEGFR2 tyrosine kinases. Bioorg Med Chem Lett 18:2793-8 (2008)  
Target
Name:
Vascular endothelial growth factor receptor 2
Synonyms:
CD_antigen=CD309 Fetal liver kinase 1 (FLK-1) KDR Protein-tyrosine kinase receptor Flk-1 VEGFR-2 VEGFR2 Vascular Endothelial Growth Factor Receptor Kinase 2 Vascular endothelial growth factor receptor 2 (KDR) Vascular endothelial growth factor receptor 2 (VEGFR2) Vascular endothelial growth factor receptor-2 (VEGFR-2)
Type:
Receptor Tyrosine Kinase
Mol. Mass.:
151510.97
Organism:
Homo sapiens (Human)
Description:
P35968
Residue:
1356
  
Inhibitor
Name:
BDBM24497
Synonyms:
3-[3-fluoro-4-({2-[(4-methylpiperazin-1-yl)carbonyl]thieno[3,2-b]pyridin-7-yl}oxy)phenyl]-1-(2-phenylacetyl)thiourea | thieno[3,2-b]pyridine-based inhibitor, 8g
Type:
Small organic molecule
Emp. Form.:
C28H26FN5O3S2
Mol. Mass.:
563.666
SMILES:
CN1CCN(CC1)C(=O)c1cc2nccc(Oc3ccc(NC(=S)NC(=O)Cc4ccccc4)cc3F)c2s1
:
Substrate
Name:
poly(Glu4, Tyr)
Synonyms:
Type:
Random copolymer
Mol. Mass.:
358.43
Organism:
Description:
Residue:
3
NA