Target
Serine/threonine-protein kinase pim-3
Ligand
BDBM291213
Substrate
Meas. Tech.
Enzyme Assay
IC50
<10±n/a nM
Citation
 Sun, YFeng, HLi, YMei, SPan, JWang, AYe, HZhang, K Bicyclic aromatic carboxamide compounds useful as pim kinase inhibitors US Patent  US9890162 Publication Date 2/13/2018 
Target
Name:
Serine/threonine-protein kinase pim-3
Synonyms:
PIM3 Serine/threonine-protein kinase pim-3 (PIM3)
Type:
Protein
Mol. Mass.:
35888.19
Organism:
Homo sapiens (Human)
Description:
Q86V86
Residue:
326
  
Inhibitor
Name:
BDBM291213
Synonyms:
N-{4-[(3S,5R)-3-Amino-5-methylpiperidin-1-yl]pyridin-3-yl}-7-(3,3-dimethylazetidin-1-yl)quinoline-2-carboxamide US9890162, Example 33
Type:
Small organic molecule
Emp. Form.:
C26H32N6O
Mol. Mass.:
444.5719
SMILES:
C[C@@H]1C[C@H](N)CN(C1)c1ccncc1NC(=O)c1ccc2ccc(cc2n1)N1CC(C)(C)C1
: