Target
Trifunctional purine biosynthetic protein adenosine-3
Ligand
BDBM24686
Substrate
BDBM22589
Meas. Tech.
GAR Tfase Activity Assay
pH
7.5±n/a
Temperature
299.15±n/a K
Ki
180±n/a nM
Citation
 DeMartino, JKHwang, IConnelly, SWilson, IABoger, DL Asymmetric synthesis of inhibitors of glycinamide ribonucleotide transformylase. J Med Chem 51:5441-8 (2008)  
Target
Name:
Trifunctional purine biosynthetic protein adenosine-3
Synonyms:
GAR Tfase GART Glycinamide ribonucleotide transformylase (GAR Tfase) PRGS Thymidylate synthase/GAR transformylase/AICAR transformylase
Type:
Protein
Mol. Mass.:
107768.47
Organism:
Homo sapiens (Human)
Description:
P22102
Residue:
1010
  
Inhibitor
Name:
BDBM24686
Synonyms:
10-thiomethyl-DDACTHF, 10S-3 2-({4-[(1S)-4-(2,4-diamino-6-oxo-1,6-dihydropyrimidin-5-yl)-1-(methylsulfanyl)butyl]phenyl}formamido)pentanedioic acid
Type:
Small organic molecule
Emp. Form.:
C21H27N5O6S
Mol. Mass.:
477.534
SMILES:
CS[C@@H](CCCc1c(N)nc(N)[nH]c1=O)c1ccc(cc1)C(=O)NC(CCC(O)=O)C(O)=O
:
Substrate
Name:
BDBM22589
Synonyms:
GAR glycineamide ribonucleotide | {[(2R,3S,4R,5R)-5-(2-aminoacetamido)-3,4-dihydroxyoxolan-2-yl]methoxy}phosphonic acid
Type:
Nucleoside or nucleotide
Emp. Form.:
C7H15N2O8P
Mol. Mass.:
286.1764
SMILES:
NCC(=O)N[C@@H]1O[C@H](COP(O)(O)=O)[C@@H](O)[C@H]1O
: