Target
RAC-beta serine/threonine-protein kinase
Ligand
BDBM24897
Substrate
biotinylated Akt peptide substrate
Meas. Tech.
Akt Inhibition Assay
pH
7.5±n/a
Temperature
295.15±n/a K
IC50
101±n/a nM
Citation
 Hartnett, JCBarnett, SFBilodeau, MTDefeo-Jones, DHartman, GDHuber, HEJones, REKral, AMRobinson, RGWu, Z Optimization of 2,3,5-trisubstituted pyridine derivatives as potent allosteric Akt1 and Akt2 inhibitors. Bioorg Med Chem Lett 18:2194-7 (2008)  
Target
Name:
RAC-beta serine/threonine-protein kinase
Synonyms:
AKT2 PKB beta Protein kinase B (Akt 2) Protein kinase B, beta RAC-alpha serine/threonine-protein kinase (AKT2) RAC-beta serine/threonine-protein kinase (AKT2) Serine/threonine-protein kinase AKT2 | Serine/threonine-protein kinase Rac alpha/beta
Type:
Enzyme
Mol. Mass.:
55766.64
Organism:
Homo sapiens (Human)
Description:
Residue:
481
  
Inhibitor
Name:
BDBM24897
Synonyms:
1-[1-({4-[3-phenyl-5-(1H-1,2,4-triazol-3-yl)pyridin-2-yl]phenyl}methyl)piperidin-4-yl]-1H-pyrazolo[3,4-d]pyrimidin-4-amine | 2,3,5-trisubstituted pyridine, 13e
Type:
Small organic molecule
Emp. Form.:
C30H28N10
Mol. Mass.:
528.6103
SMILES:
Nc1ncnc2n(ncc12)C1CCN(Cc2ccc(cc2)-c2ncc(cc2-c2ccccc2)-c2nnc[nH]2)CC1
:
Substrate
Name:
biotinylated Akt peptide substrate
Synonyms:
Type:
Peptide
Mol. Mass.:
1734.89
Organism:
Description:
Residue:
17
ITINGGRARTSSFAEPG