Target
Serine/threonine-protein kinase PLK2
Ligand
BDBM24933
Substrate
CHK2 Substrate Peptide
Meas. Tech.
Plk in Vitro Assay
pH
7.2±n/a
Temperature
303.15±n/a K
IC50
4±n/a nM
Citation
 Hanan, EJFucini, RVRomanowski, MJElling, RALew, WPurkey, HEVanderPorten, ECYang, W Design and synthesis of 2-amino-isoxazolopyridines as Polo-like kinase inhibitors. Bioorg Med Chem Lett 18:5186-9 (2008)  
Target
Name:
Serine/threonine-protein kinase PLK2
Synonyms:
PLK2 Polo-Like Kinase 2 Serine/threonine-protein kinase PLK2 Serum-inducible kinase
Type:
Serine/threonine-protein kinase
Mol. Mass.:
78259.87
Organism:
Homo sapiens (Human)
Description:
Full-length human PLK2 was expressed as GST-fusion protein using baculovirus expression system. GST-PLK2 was purified by using glutathione sepharose chromatography.
Residue:
685
  
Inhibitor
Name:
BDBM24933
Synonyms:
2-amino-isoxazolopyridine, 9 | 3-(2H-1,3-benzodioxol-5-yl)-N-[(1S)-1-phenylethyl]pyrido[4,3-d][1,2]oxazol-5-amine
Type:
Small organic molecule
Emp. Form.:
C21H17N3O3
Mol. Mass.:
359.378
SMILES:
C[C@H](Nc1cc2c(noc2cn1)-c1ccc2OCOc2c1)c1ccccc1
:
Substrate
Name:
CHK2 Substrate Peptide
Synonyms:
CHK2tide
Type:
Fluorophore tagged peptide
Mol. Mass.:
1755.03
Organism:
Description:
Residue:
14
AMRLERQDSIFYPK