Target
RAC-alpha serine/threonine-protein kinase
Ligand
BDBM25006
Substrate
AKT Substrate Peptide
Meas. Tech.
In Vitro Kinase Inhibition Assay
pH
7.5±n/a
Temperature
295.15±n/a K
IC50
794±n/a nM
Citation
 Heerding, DARhodes, NLeber, JDClark, TJKeenan, RMLafrance, LVLi, MSafonov, IGTakata, DTVenslavsky, JWYamashita, DSChoudhry, AECopeland, RALai, ZSchaber, MDTummino, PJStrum, SLWood, ERDuckett, DREberwein, DKnick, VBLansing, TJMcConnell, RTZhang, SMinthorn, EAConcha, NOWarren, GLKumar, R Identification of 4-(2-(4-amino-1,2,5-oxadiazol-3-yl)-1-ethyl-7-{[(3S)-3-piperidinylmethyl]oxy}-1H-imidazo[4,5-c]pyridin-4-yl)-2-methyl-3-butyn-2-ol (GSK690693), a novel inhibitor of AKT kinase. J Med Chem 51:5663-79 (2008)  
Target
Name:
RAC-alpha serine/threonine-protein kinase
Synonyms:
AKT phosphorylation (p-AKT) AKT1/PPP1CA C-AKT PKB alpha Protein kinase B Protein kinase B (Akt 1) Protein kinase B alpha Proto-oncogene Akt (Akt1) Proto-oncogene c-Akt (AKT1) RAC-PK-alpha RAC-alpha serine/threonine-protein kinase (AKT1) | RAC-alpha serine/threonine-protein kinase (pAKT)
Type:
Enzyme
Mol. Mass.:
55681.25
Organism:
Homo sapiens (Human)
Description:
P31749
Residue:
480
  
Inhibitor
Name:
BDBM25006
Synonyms:
4-[4-(3-aminoprop-1-yn-1-yl)-7-(3-aminopropoxy)-1-ethyl-1H-imidazo[4,5-c]pyridin-2-yl]-1,2,5-oxadiazol-3-amine | oxadiazole-containing compound, 13
Type:
Small organic molecule
Emp. Form.:
C16H20N8O2
Mol. Mass.:
356.3824
SMILES:
CCn1c(nc2c(ncc(OCCCN)c12)C#CCN)-c1nonc1N
:
Substrate
Name:
AKT Substrate Peptide
Synonyms:
Type:
Peptide
Mol. Mass.:
1689.88
Organism:
Description:
Residue:
14
ARKRERAYSFGHHA