Target
RAC-beta serine/threonine-protein kinase
Ligand
BDBM25009
Substrate
AKT Substrate Peptide
Meas. Tech.
In Vitro Kinase Inhibition Assay
IC50
20±n/a nM
Citation
 Heerding, DARhodes, NLeber, JDClark, TJKeenan, RMLafrance, LVLi, MSafonov, IGTakata, DTVenslavsky, JWYamashita, DSChoudhry, AECopeland, RALai, ZSchaber, MDTummino, PJStrum, SLWood, ERDuckett, DREberwein, DKnick, VBLansing, TJMcConnell, RTZhang, SMinthorn, EAConcha, NOWarren, GLKumar, R Identification of 4-(2-(4-amino-1,2,5-oxadiazol-3-yl)-1-ethyl-7-{[(3S)-3-piperidinylmethyl]oxy}-1H-imidazo[4,5-c]pyridin-4-yl)-2-methyl-3-butyn-2-ol (GSK690693), a novel inhibitor of AKT kinase. J Med Chem 51:5663-79 (2008)  
Target
Name:
RAC-beta serine/threonine-protein kinase
Synonyms:
AKT2 PKB beta Protein kinase B (Akt 2) Protein kinase B, beta RAC-alpha serine/threonine-protein kinase (AKT2) RAC-beta serine/threonine-protein kinase (AKT2) Serine/threonine-protein kinase AKT2 | Serine/threonine-protein kinase Rac alpha/beta
Type:
Enzyme
Mol. Mass.:
55766.64
Organism:
Homo sapiens (Human)
Description:
Residue:
481
  
Inhibitor
Name:
BDBM25009
Synonyms:
4-[2-(4-amino-1,2,5-oxadiazol-3-yl)-7-(2-aminoethoxy)-1-ethyl-1H-imidazo[4,5-c]pyridin-4-yl]-2-methylbut-3-yn-2-ol | oxadiazole-containing compound, 3c
Type:
Small organic molecule
Emp. Form.:
C17H21N7O3
Mol. Mass.:
371.3937
SMILES:
CCn1c(nc2c(ncc(OCCN)c12)C#CC(C)(C)O)-c1nonc1N
:
Substrate
Name:
AKT Substrate Peptide
Synonyms:
Type:
Peptide
Mol. Mass.:
1689.88
Organism:
Description:
Residue:
14
ARKRERAYSFGHHA