Target
Ribosomal protein S6 kinase alpha-1
Ligand
BDBM25004
Substrate
ROCK1 Substrate Peptide
Meas. Tech.
In Vitro Kinase Inhibition Assay
IC50
1±n/a nM
Citation
 Heerding, DARhodes, NLeber, JDClark, TJKeenan, RMLafrance, LVLi, MSafonov, IGTakata, DTVenslavsky, JWYamashita, DSChoudhry, AECopeland, RALai, ZSchaber, MDTummino, PJStrum, SLWood, ERDuckett, DREberwein, DKnick, VBLansing, TJMcConnell, RTZhang, SMinthorn, EAConcha, NOWarren, GLKumar, R Identification of 4-(2-(4-amino-1,2,5-oxadiazol-3-yl)-1-ethyl-7-{[(3S)-3-piperidinylmethyl]oxy}-1H-imidazo[4,5-c]pyridin-4-yl)-2-methyl-3-butyn-2-ol (GSK690693), a novel inhibitor of AKT kinase. J Med Chem 51:5663-79 (2008)  
Target
Name:
Ribosomal protein S6 kinase alpha-1
Synonyms:
90 kDa ribosomal protein S6 kinase 1 MAP kinase-activated protein kinase 1a RPS6KA1 RPS6KA1(Kin.Dom.2 - C-terminal) RSK1 Ribosomal S6 kinase 1 Ribosomal protein S6 kinase alpha 1 Ribosomal protein S6 kinase alpha-1 (RSK1) p90-RSK 1 p90S6K | pp90RSK1
Type:
Serine/threonine-protein kinase
Mol. Mass.:
82736.10
Organism:
Homo sapiens (Human)
Description:
Residue:
735
  
Inhibitor
Name:
BDBM25004
Synonyms:
3-[2-(4-amino-1,2,5-oxadiazol-3-yl)-7-(3-aminopropoxy)-1-ethyl-1H-imidazo[4,5-c]pyridin-4-yl]prop-2-yn-1-ol | oxadiazole-containing compound, 12c
Type:
Small organic molecule
Emp. Form.:
C16H19N7O3
Mol. Mass.:
357.3672
SMILES:
CCn1c(nc2c(ncc(OCCCN)c12)C#CCO)-c1nonc1N
:
Substrate
Name:
ROCK1 Substrate Peptide
Synonyms:
RSK1 Substrate Peptide
Type:
Peptide
Mol. Mass.:
1318.60
Organism:
Description:
Residue:
11
AKRRRLSSLRA