Target
Serine/threonine-protein kinase PLK4
Ligand
BDBM8826
Substrate
Biotinylated Peptide A-A11
Meas. Tech.
PLK Kinase Assay
Ki
130±n/a nM
Citation
 Johnson, EFStewart, KDWoods, KWGiranda, VLLuo, Y Pharmacological and functional comparison of the polo-like kinase family: insight into inhibitor and substrate specificity. Biochemistry 46:9551-63 (2007)  
Target
Name:
Serine/threonine-protein kinase PLK4
Synonyms:
PLK4 Polo-Like Kinase 4 STK18 | Serine/threonine-protein kinase PLK4
Type:
PROTEIN
Mol. Mass.:
108996.91
Organism:
Homo sapiens (Human)
Description:
ChEMBL_1474078
Residue:
970
  
Inhibitor
Name:
BDBM8826
Synonyms:
3-(4-{4-aminothieno[2,3-d]pyrimidin-5-yl}phenyl)-1-(3-methylphenyl)urea CHEMBL196363 N-[4-(4-Aminothieno[2,3-d]pyrimidin-5-yl)phenyl]-N -(3-methylphenyl)urea | Thienopyrimidine deriv. 76
Type:
Small organic molecule
Emp. Form.:
C20H17N5OS
Mol. Mass.:
375.447
SMILES:
Cc1cccc(NC(=O)Nc2ccc(cc2)-c2csc3ncnc(N)c23)c1
:
Substrate
Name:
Biotinylated Peptide A-A11
Synonyms:
Type:
Peptide
Mol. Mass.:
1379.40
Organism:
Description:
Residue:
13
TPSDSLIYDDGLS