Target
Procathepsin L
Ligand
BDBM25139
Substrate
BDBM19485
Meas. Tech.
Enzyme Inhibition Assay
IC50
>1000±n/a nM
Citation
 Irie, OKosaka, TEhara, TYokokawa, FKanazawa, THirao, HIwasaki, ASakaki, JTeno, NHitomi, YIwasaki, GFukaya, HNonomura, KTanabe, KKoizumi, SUchiyama, NBevan, SJMalcangio, MGentry, CFox, AJYaqoob, MCulshaw, AJ Discovery of orally bioavailable cathepsin S inhibitors for the reversal of neuropathic pain. J Med Chem 51:5502-5 (2008)  
Target
Name:
Procathepsin L
Synonyms:
CATL1_HUMAN CTSL CTSL1 Cathepsin L Cathepsin L1 heavy chain MEP cathepsin L preproprotein
Type:
Enzyme
Mol. Mass.:
37557.19
Organism:
Homo sapiens (Human)
Description:
Purchased from Calbiochem (San Diego, CA).
Residue:
333
  
Inhibitor
Name:
BDBM25139
Synonyms:
2-cyano-pyrropyrimidine, 7e | 7-[2-(4-chlorophenyl)ethyl]-6-[4-(4-acetylpiperazin-1-yl)phenoxymethyl]-7H-pyrrolo[2,3-d]pyrimidine-2-carbonitrile
Type:
Small organic molecule
Emp. Form.:
C28H27ClN6O2
Mol. Mass.:
515.006
SMILES:
CC(=O)N1CCN(CC1)c1ccc(OCc2cc3cnc(nc3n2CCc2ccc(Cl)cc2)C#N)cc1
:
Substrate
Name:
BDBM19485
Synonyms:
Cbz-Phe-Arg-AMC Z-Phe-Arg-AMC.HCl
Type:
Emp. Form.:
Mol. Mass.:
SMILES:
: