Target
Histone deacetylase 2
Ligand
BDBM19149
Substrate
BDBM25143
Meas. Tech.
HDAC Activity Assay
pH
8±n/a
Temperature
310.15±n/a K
IC50
82±n/a nM
Citation
 Jones, PAltamura, SDe Francesco, RPaz, OGKinzel, OMesiti, GMonteagudo, EPescatore, GRowley, MVerdirame, MSteinkühler, C A novel series of potent and selective ketone histone deacetylase inhibitors with antitumor activity in vivo. J Med Chem 51:2350-3 (2008)  
Target
Name:
Histone deacetylase 2
Synonyms:
Cereblon/Histone deacetylase 2 HDAC2 Histone deacetylase 2 (HDAC2) | Human HDAC2
Type:
Chromatin regulator; hydrolase; repressor
Mol. Mass.:
55356.54
Organism:
Homo sapiens (Human)
Description:
Q92769
Residue:
488
  
Inhibitor
Name:
BDBM19149
Synonyms:
CHEMBL98 SAHA US10188756, Compound SAHA US11505523, Compound SAHA US9353061, SAHA US9695181, Vorinostat Zolinza suberoylanilide hydroxamic acid
Type:
Small organic molecule
Emp. Form.:
C14H20N2O3
Mol. Mass.:
264.3202
SMILES:
ONC(=O)CCCCCCC(=O)Nc1ccccc1
:
Substrate
Name:
BDBM25143
Synonyms:
Fluor-de-Lys Fluorogenic Deacetylase Substrate | KI-104 (BioMol Research Laboratories)
Type:
Fluorogenic Substrate
Emp. Form.:
Mol. Mass.:
SMILES:
: