Target
Histone-lysine N-methyltransferase EZH2
Ligand
BDBM326103
Substrate
Meas. Tech.
Wild-Type PRC2 Enzyme Assay
IC50
<300±n/a nM
Citation
 Kuntz, KWOlhava, EJChesworth, RDuncan, KW Substituted 6,5-fused bicyclic heteroaryl compounds US Patent  US10273223 Publication Date 4/30/2019 
Target
Name:
Histone-lysine N-methyltransferase EZH2
Synonyms:
ENX-1 EZH2_HUMAN Histone-lysine N-methyltransferase EZH2 Lysine N-methyltransferase 6
Type:
Protein
Mol. Mass.:
85367.84
Organism:
Homo sapiens (Human)
Description:
Q15910
Residue:
746
  
Inhibitor
Name:
BDBM326103
Synonyms:
US10273223, Compound D-40 US9637472, Compound D-40
Type:
Small organic molecule
Emp. Form.:
C21H23BrN4O2
Mol. Mass.:
443.337
SMILES:
Cc1cc(C)c(CNC(=O)c2cc(Br)cc3n(ncc23)C2CCCC2)c(=O)[nH]1
: