Target
Serine/threonine-protein kinase PLK1
Ligand
BDBM25519
Substrate
Cdc25C Substrate Peptide
Meas. Tech.
Plk in Vitro Assay
pH
7.2±n/a
Temperature
303.15±n/a K
IC50
48±n/a nM
Citation
 Fucini, RVHanan, EJRomanowski, MJElling, RALew, WBarr, KJZhu, JYoburn, JCLiu, YFahr, BTFan, JLu, YPham, PChoong, ICVanderPorten, ECBui, MPurkey, HEEvanchik, MJYang, W Design and synthesis of 2-amino-pyrazolopyridines as Polo-like kinase 1 inhibitors. Bioorg Med Chem Lett 18:5648-52 (2008)  
Target
Name:
Serine/threonine-protein kinase PLK1
Synonyms:
PLK PLK1 Polo-like kinase 1 (PlK1) STPK13 Serine/threonine-protein kinase 13 | polo-like kinase
Type:
Serine/threonine-protein kinase
Mol. Mass.:
68277.16
Organism:
Homo sapiens (Human)
Description:
P53350
Residue:
603
  
Inhibitor
Name:
BDBM25519
Synonyms:
2-amino-pyrazolopyridine, 30 | 3-[3-chloro-5-(3-methyl-6-{[(1S)-1-phenylethyl]amino}-1H-pyrazolo[4,3-c]pyridin-1-yl)phenyl]-N-(2-hydroxyethyl)propanamide
Type:
Small organic molecule
Emp. Form.:
C26H28ClN5O2
Mol. Mass.:
477.986
SMILES:
C[C@H](Nc1cc2n(nc(C)c2cn1)-c1cc(Cl)cc(CCC(=O)NCCO)c1)c1ccccc1
:
Substrate
Name:
Cdc25C Substrate Peptide
Synonyms:
5-carboxamido-fluorescein (5FAM) labeled peptide
Type:
Fluorophore tagged peptide
Mol. Mass.:
2066.83
Organism:
Description:
Residue:
18
FAMRALMEASFADQARNH