Target
Bcl-2-like protein 1
Ligand
BDBM25525
Substrate
Bak-BH3 peptide
Meas. Tech.
Fluorescence Polarization Assay
pH
8±n/a
Temperature
295.15±n/a K
IC50
19000±n/a nM
Citation
 Bernardo, PHWan, KFSivaraman, TXu, JMoore, FKHung, AWMok, HYYu, VCChai, CL Structure-activity relationship studies of phenanthridine-based Bcl-XL inhibitors. J Med Chem 51:6699-710 (2008)  
Target
Name:
Bcl-2-like protein 1
Synonyms:
Anti-apoptotic Bcl-2 protein Apoptosis regulator Bcl-X BCL2-like 1 isoform 1 BCL2L1 Bcl-2-like protein 1 (Bcl-XL) Bcl-xL/Bcl-2-binding component 3 Bcl2-antagonist of cell death (BAD)
Type:
Mitochondrion membrane; Single-pass membrane protein
Mol. Mass.:
26039.60
Organism:
Homo sapiens (Human)
Description:
Residue:
233
  
Inhibitor
Name:
BDBM25525
Synonyms:
24-methyl-5,7,18,20-tetraoxa-24-azahexacyclo[11.11.0.0^{2,10}.0^{4,8}.0^{14,22}.0^{17,21}]tetracosa-1(13),2,4(8),9,11,14(22),15,17(21),23-nonaen-24-ium Pseudochelerythrine cid_5154 sangvinarin
Type:
Small organic molecule
Emp. Form.:
C20H14NO4
Mol. Mass.:
332.3289
SMILES:
C[n+]1cc2c3OCOc3ccc2c2ccc3cc4OCOc4cc3c12
:
Substrate
Name:
Bak-BH3 peptide
Synonyms:
F-BakBH3
Type:
Fluorescein-labeled peptide
Mol. Mass.:
1724.92
Organism:
Description:
Derived from human apoptosis regulator BAK (residues 72-87).
Residue:
16
GQVGRQLAIIGDDINR