Target
Serine/threonine-protein kinase B-raf
Ligand
BDBM25634
Substrate
GST-MEK
Meas. Tech.
B-Raf Activity Assay
pH
7.2±n/a
Temperature
295.15±n/a K
IC50
0.39±n/a nM
Citation
 Hansen, JDGrina, JNewhouse, BWelch, MTopalov, GLittman, NCallejo, MGloor, SMartinson, MLaird, EBrandhuber, BJVigers, GMorales, TWoessner, RRandolph, NLyssikatos, JOlivero, A Potent and selective pyrazole-based inhibitors of B-Raf kinase. Bioorg Med Chem Lett 18:4692-5 (2008)  
Target
Name:
Serine/threonine-protein kinase B-raf
Synonyms:
B-RAF B-Raf proto-oncogene serine/threonine-protein kinase BRAF1 RAFB1 v-Raf murine sarcoma viral oncogene homolog B1
Type:
Serine/threonine-protein kinase
Mol. Mass.:
84446.00
Organism:
Homo sapiens (Human)
Description:
P15056
Residue:
766
  
Inhibitor
Name:
BDBM25634
Synonyms:
3-{4-[(1Z)-1-(hydroxyimino)-2,3-dihydro-1H-inden-5-yl]-3-(pyridin-4-yl)-1H-pyrazol-1-yl}propan-1-amine | pyrazole based inhibitor, 16
Type:
Small organic molecule
Emp. Form.:
C20H21N5O
Mol. Mass.:
347.4136
SMILES:
NCCCn1cc(c(n1)-c1ccncc1)-c1ccc2C(CCc2c1)N=O
:
Substrate
Name:
GST-MEK
Synonyms:
GST-kdMEK
Type:
Other Protein Type
Mol. Mass.:
358.43
Organism:
Description:
This protein is purified from bacterial cells expression mutant inactive MEK as a fusion protein with glutathione-S-transferase (GST-kdMEK).
Residue:
3
NA