Target
Aurora kinase A
Ligand
BDBM25683
Substrate
CHOCKtide
Meas. Tech.
Aurora Kinase SPA Assay
pH
7±n/a
Temperature
295.15±n/a K
IC50
97±n/a nM
Citation
 Andersen, CBWan, YChang, JWRiggs, BLee, CLiu, YSessa, FVilla, FKwiatkowski, NSuzuki, MNallan, LHeald, RMusacchio, AGray, NS Discovery of selective aminothiazole aurora kinase inhibitors. ACS Chem Biol 3:180-92 (2008)  
Target
Name:
Aurora kinase A
Synonyms:
AIK ARK1 AURKA AYK1 Aurora kinase A (AURA) Aurora kinase A (Aurora A) Aurora-related kinase 1 BTAK Breast-tumor-amplified kinase STK15 Serine/threonine kinase 15 Serine/threonine-protein kinase aurora A hARK1
Type:
Serine/threonine-protein kinase
Mol. Mass.:
45830.98
Organism:
Homo sapiens (Human)
Description:
O14965
Residue:
403
  
Inhibitor
Name:
BDBM25683
Synonyms:
4-[(5-bromo-1,3-thiazol-2-yl)amino]-N-(2-methoxyethyl)benzamide | aminothiazole analogue, 27
Type:
Small organic molecule
Emp. Form.:
C13H14BrN3O2S
Mol. Mass.:
356.238
SMILES:
COCCNC(=O)c1ccc(Nc2ncc(Br)s2)cc1
:
Substrate
Name:
CHOCKtide
Synonyms:
Type:
Peptide
Mol. Mass.:
889.06
Organism:
Description:
Residue:
7
LRRWSLG