Target
Beta-2 adrenergic receptor
Ligand
BDBM25759
Substrate
BDBM25747
Meas. Tech.
3H-CGP 12177 Whole Cell Binding Assay
Kd
0.4±n/a nM
Citation
 Baker, JG The selectivity of beta-adrenoceptor antagonists at the human beta1, beta2 and beta3 adrenoceptors. Br J Pharmacol 144:317-22 (2005)  
Target
Name:
Beta-2 adrenergic receptor
Synonyms:
ADRB2 ADRB2_HUMAN Beta-2 adrenoceptor | Beta-2 adrenoreceptor
Type:
Mol. Mass.:
46461.69
Organism:
Homo sapiens (Human)
Description:
P07550
Residue:
413
  
Inhibitor
Name:
BDBM25759
Synonyms:
CHEMBL723 Coreg Eucardic | [3-(9H-carbazol-4-yloxy)-2-hydroxypropyl][2-(2-methoxyphenoxy)ethyl]amine
Type:
Small organic molecule
Emp. Form.:
C24H26N2O4
Mol. Mass.:
406.4742
SMILES:
COc1ccccc1OCCNCC(O)COc1cccc2[nH]c3ccccc3c12
:
Substrate
Name:
BDBM25747
Synonyms:
4-[3-(tert-butylamino)-2-hydroxypropoxy]-2,3-dihydro-1H-1,3-benzodiazol-2-one hydrochloride CGP-12177 [3H]CGP 12177
Type:
radiolabeled ligand
Emp. Form.:
C14H21N3O3
Mol. Mass.:
279.3348
SMILES:
CC(C)(C)NCC(O)COc1cccc2[nH]c(=O)[nH]c12
: