Target
Beta-2 adrenergic receptor
Ligand
BDBM25763
Substrate
BDBM25747
Meas. Tech.
3H-CGP 12177 Whole Cell Binding Assay
Kd
79433±n/a nM
Citation
 Baker, JG The selectivity of beta-adrenoceptor antagonists at the human beta1, beta2 and beta3 adrenoceptors. Br J Pharmacol 144:317-22 (2005)  
Target
Name:
Beta-2 adrenergic receptor
Synonyms:
ADRB2 ADRB2_HUMAN Beta-2 adrenoceptor | Beta-2 adrenoreceptor
Type:
Mol. Mass.:
46461.69
Organism:
Homo sapiens (Human)
Description:
P07550
Residue:
413
  
Inhibitor
Name:
BDBM25763
Synonyms:
5-[(2R)-2-{[(2R)-2-(3-chlorophenyl)-2-hydroxyethyl]amino}propyl]-2H-1,3-benzodioxole-2,2-dicarboxylic acid | CL 316243
Type:
Small organic molecule
Emp. Form.:
C20H20ClNO7
Mol. Mass.:
421.828
SMILES:
C[C@H](Cc1ccc2OC(Oc2c1)(C(O)=O)C(O)=O)NC[C@H](O)c1cccc(Cl)c1
:
Substrate
Name:
BDBM25747
Synonyms:
4-[3-(tert-butylamino)-2-hydroxypropoxy]-2,3-dihydro-1H-1,3-benzodiazol-2-one hydrochloride CGP-12177 [3H]CGP 12177
Type:
radiolabeled ligand
Emp. Form.:
C14H21N3O3
Mol. Mass.:
279.3348
SMILES:
CC(C)(C)NCC(O)COc1cccc2[nH]c(=O)[nH]c12
: