Target
Carbonic anhydrase 3
Ligand
BDBM25911
Substrate
BDBM10856
Meas. Tech.
CA Inhibition Assay
Ki
7400000±n/a nM
Citation
 Güzel, OInnocenti, AScozzafava, ASalman, AParkkila, SHilvo, MSupuran, CT Carbonic anhydrase inhibitors: synthesis and inhibition studies against mammalian isoforms I-XV with a series of 2-(hydrazinocarbonyl)-3-substituted-phenyl-1H-indole-5-sulfonamides. Bioorg Med Chem 16:9113-20 (2008)  
Target
Name:
Carbonic anhydrase 3
Synonyms:
CA-III CAH3_HUMAN Carbonic Anhydrase III Carbonic anhydrase 3 (CA III) | Carbonic anhydrase III (CA III)
Type:
Enzyme
Mol. Mass.:
29562.11
Organism:
Homo sapiens (Human)
Description:
Human cloned isozyme.
Residue:
260
  
Inhibitor
Name:
BDBM25911
Synonyms:
3-(2-chlorophenyl)-2-(hydrazinecarbonyl)-1H-indole-5-sulfonamide indole sulfonamide, 8g
Type:
Small organic molecule
Emp. Form.:
C15H13ClN4O3S
Mol. Mass.:
364.807
SMILES:
NNC(=O)c1[nH]c2ccc(cc2c1-c1ccccc1Cl)S(N)(=O)=O
:
Substrate
Name:
BDBM10856
Synonyms:
Carbon Dioxide | methanedione
Type:
Small organic molecule
Emp. Form.:
CO2
Mol. Mass.:
44.0095
SMILES:
O=C=O
: