Target
Caspase-3
Ligand
BDBM229
Substrate
Caspase-3 Fluorogenic Substrate
Meas. Tech.
Fluorometric Assay
pH
7.4±n/a
Temperature
298.15±n/a K
Ki
90±n/a nM
Citation
 Choong, ICLew, WLee, DPham, PBurdett, MTLam, JWWiesmann, CLuong, TNFahr, BDeLano, WLMcDowell, RSAllen, DAErlanson, DAGordon, EMO'Brien, T Identification of potent and selective small-molecule inhibitors of caspase-3 through the use of extended tethering and structure-based drug design. J Med Chem 45:5005-22 (2002)  
Target
Name:
Caspase-3
Synonyms:
Apopain CASP3 CPP-32 Caspase 3 Caspase-3 subunit p17 SCA-1 Yama protein | caspase-3 preproprotein
Type:
Hydrolase; heterotetramer of two heterodimers
Mol. Mass.:
31607.55
Organism:
Homo sapiens (Human)
Description:
Residue:
277
  
Inhibitor
Name:
BDBM229
Synonyms:
(S)-5-({5-[1-Carboxymethyl-3-(2-chloro-benzylsulfanyl)-2-oxo-propylcarbamoyl]pyrazin-2-ylmethyl}sulfamoyl)-2-hydroxy-benzoic Acid Heterocyclic deriv. 63b | Inhibitor 63b
Type:
Small organic molecule
Emp. Form.:
C25H23ClN4O9S2
Mol. Mass.:
623.055
SMILES:
OC(=O)C[C@H](NC(=O)c1cnc(CNS(=O)(=O)c2ccc(O)c(c2)C(O)=O)cn1)C(=O)CSCc1ccccc1Cl
:
Substrate
Name:
Caspase-3 Fluorogenic Substrate
Synonyms:
Caspase-3 Fluorogenic Substrate Ac-Asp-Glu-Val-Asp-AFC | Fluorometric Tetrapeptide Ac-DEVD-AMC
Type:
Mol. Mass.:
1477.75
Organism:
Description:
AFC = 7-Amino-4-trifluoromethylcoumarin
Residue:
16
ACASPGLVALASPAFC