Target
cGMP-dependent 3',5'-cyclic phosphodiesterase
Ligand
BDBM384991
Substrate
Meas. Tech.
PDE2 Assay B
Ki
0.073±n/a nM
Citation
 Shen, DWang, DQian, XHarper, BYang, MBo, Y Pyrimidinone amide compounds as PDE2 inhibitors US Patent  US10285989 Publication Date 5/14/2019 
Target
Name:
cGMP-dependent 3',5'-cyclic phosphodiesterase
Synonyms:
CGS-PDE Homo sapiens phosphodiesterase 2A (PDE2A) PDE2A cGSPDE
Type:
Enzyme Catalytic Domain
Mol. Mass.:
105691.58
Organism:
Homo sapiens (Human)
Description:
O00408
Residue:
941
  
Inhibitor
Name:
BDBM384991
Synonyms:
2-(dimethylamino)-N-{(1S)-2- hydroxy-2-methyl-1-[4- (pentafluoro-lambda6- sulfanyl)phenyl]propyl}-6-oxo- 1,6-dihydropyrimidine-4- carboxamide | US10285989, Example 211
Type:
Small organic molecule
Emp. Form.:
C17H21F5N4O3S
Mol. Mass.:
456.431
SMILES:
CN(C)c1nc(cc(=O)[nH]1)C(=O)N[C@@H](c1ccc(cc1)S(F)(F)(F)(F)F)C(C)(C)O
: