Target
Proto-oncogene tyrosine-protein kinase LCK
Ligand
BDBM25981
Substrate
Biotinylated Peptide Substrate
Meas. Tech.
Time Resolved Fluorescence Resonance Energy Transfer Assay
pH
7.4±n/a
Temperature
295.15±n/a K
Ki
>5400±n/a nM
IC50
>16000±n/a nM
Citation
 Angell, RMBamborough, PCleasby, ACockerill, SGJones, KLMooney, CJSomers, DOWalker, AL Biphenyl amide p38 kinase inhibitors 1: Discovery and binding mode. Bioorg Med Chem Lett 18:318-23 (2008)  
Target
Name:
Proto-oncogene tyrosine-protein kinase LCK
Synonyms:
LCK_MOUSE Lck Lymphocyte cell-specific protein-tyrosine kinase Tyrosine-protein kinase LCK | p56-LCK
Type:
PROTEIN
Mol. Mass.:
57927.84
Organism:
Mus musculus
Description:
ChEMBL_806408
Residue:
509
  
Inhibitor
Name:
BDBM25981
Synonyms:
BMCL18324 Compound 17 D3RKN_78 biphenyl amide, 4
Type:
Small organic molecule
Emp. Form.:
C21H21N3O2
Mol. Mass.:
347.4103
SMILES:
Cc1nnc(o1)-c1ccc(C)c(c1)-c1ccc(cc1)C(=O)NCC1CC1
:
Substrate
Name:
Biotinylated Peptide Substrate
Synonyms:
Type:
Peptide
Mol. Mass.:
1622.70
Organism:
Description:
Residue:
13
ITINEEEEYFELV