Target
Serine/threonine-protein kinase B-raf [V600E]
Ligand
BDBM26016
Substrate
MEK Inactive Mutant
Meas. Tech.
RAF Kinase Inhibition Assay
IC50
11±n/a nM
Citation
 Ramurthy, SSubramanian, SAikawa, MAmiri, PCostales, ADove, JFong, SJansen, JMLevine, BMa, SMcBride, CMMichaelian, JPick, TPoon, DJGirish, SShafer, CMStuart, DSung, LRenhowe, PA Design and Synthesis of Orally Bioavailable Benzimidazoles as Raf Kinase Inhibitors. J Med Chem 51:7049-52 (2008)  
Target
Name:
Serine/threonine-protein kinase B-raf [V600E]
Synonyms:
B-RAF V600E B-Raf Protein Kinase Mutant (V600E) BRAF BRAF mutant V600E BRAF_HUMAN Protein mono-ADP-ribosyltransferase (PARP3) RAFB1 Serine/threonine-protein kinase B-raf (V600E) V-RAF murine sarcoma viral oncogene homologue B1 mutant (BRAF V600E)
Type:
Mol. Mass.:
84474.98
Organism:
Homo sapiens (Human)
Description:
P15056 V600E
Residue:
766
  
Inhibitor
Name:
BDBM26016
Synonyms:
N-methyl-4-[(2-{[4-(trifluoromethyl)phenyl]amino}-1H-1,3-benzodiazol-5-yl)oxy]pyridine-2-carboxamide | arylaminobenzimidazole, 11
Type:
Small organic molecule
Emp. Form.:
C21H16F3N5O2
Mol. Mass.:
427.3792
SMILES:
CNC(=O)c1cc(Oc2ccc3nc(Nc4ccc(cc4)C(F)(F)F)[nH]c3c2)ccn1
:
Substrate
Name:
MEK Inactive Mutant
Synonyms:
Full length kinase dead MEK | kd-MEK
Type:
Other Protein Type
Mol. Mass.:
358.43
Organism:
Description:
Residue:
3
NA