Target
Metallo-beta-lactamase type 2
Ligand
BDBM262321
Substrate
Meas. Tech.
Class B Enzyme Assay
pH
7±n/a
IC50
4.39±n/a nM
Comments
extracted
Citation
 Mandal, MTang, HXiao, LSu, JLi, GYang, SPan, WTang, HDeJesus, RHicks, JLombardo, MChu, HHagmann, WPasternak, AGu, XJiang, JDong, SDing, FLondon, CBiswas, DYoung, KHunter, DNZhao, ZYang, D Metallo-beta-lactamase inhibitors US Patent  US9708336 Publication Date 7/18/2017 
Target
Name:
Metallo-beta-lactamase type 2
Synonyms:
B2 metallo-beta-lactamase Beta-lactamase NDM-1 Metallo-beta-lactamase NDM-1 Metallo-beta-lactamase type II New Delhi metallo-beta-lactamase-1 | blaNDM-1
Type:
PROTEIN
Mol. Mass.:
28498.15
Organism:
Klebsiella pneumoniae
Description:
ChEMBL_103887
Residue:
270
  
Inhibitor
Name:
BDBM262321
Synonyms:
US9708336, 173
Type:
Small organic molecule
Emp. Form.:
C15H20N6O4S
Mol. Mass.:
380.422
SMILES:
CCOC(=O)N1CCC(CC1)c1cccc(c1-c1nn[nH]n1)S(N)(=O)=O
: