Target
VIM-1 metallo-beta-lactamase
Ligand
BDBM262804
Substrate
Meas. Tech.
Class B Enzyme Assay
pH
7±n/a
IC50
2.09±n/a nM
Comments
extracted
Citation
 Mandal, MTang, HXiao, LSu, JLi, GYang, SPan, WTang, HDeJesus, RHicks, JLombardo, MChu, HHagmann, WPasternak, AGu, XJiang, JDong, SDing, FLondon, CBiswas, DYoung, KHunter, DNZhao, ZYang, D Metallo-beta-lactamase inhibitors US Patent  US9708336 Publication Date 7/18/2017 
Target
Name:
VIM-1 metallo-beta-lactamase
Synonyms:
Beta-lactamase VIM-1 VIM-1 metallo-beta-lactamase | blaVIM-1
Type:
undefined
Mol. Mass.:
28014.53
Organism:
Klebsiella pneumoniae
Description:
Q5GN09
Residue:
266
  
Inhibitor
Name:
BDBM262804
Synonyms:
3-[(3S)-3-hydroxypiperidin-1-yl]-2- (1H-tetrazol-5-yl)-6- (trifluoromethyl)benzenesulfonamide | US9708336, 657
Type:
Small organic molecule
Emp. Form.:
C13H15F3N6O3S
Mol. Mass.:
392.357
SMILES:
NS(=O)(=O)c1c(ccc(N2CCC[C@H](O)C2)c1-c1nnn[nH]1)C(F)(F)F
: