Target
AP2-associated protein kinase 1
Ligand
BDBM263006
Substrate
Meas. Tech.
AAK1 Kinase Assay
pH
7.4±n/a
Temperature
298.15±n/a K
IC50
652±n/a nM
Comments
extracted
Citation
 Vrudhula, VMDzierba, CDBronson, JJMacor, JENara, SJRajamani, RKaratholuvhu, MS Aryl amide-based kinase inhibitors US Patent  US9708337 Publication Date 7/18/2017 
Target
Name:
AP2-associated protein kinase 1
Synonyms:
AAK1 Adaptor-associated kinase 1 | KIAA1048
Type:
PROTEIN
Mol. Mass.:
103884.23
Organism:
Homo sapiens (Human)
Description:
ChEMBL_774569
Residue:
961
  
Inhibitor
Name:
BDBM263006
Synonyms:
N-(5H-chromeno[3,4-c]pyridin-8-yl)-1-cyanocyclopropanecarboxamide | US9708337, 20
Type:
Small organic molecule
Emp. Form.:
C17H13N3O2
Mol. Mass.:
291.304
SMILES:
O=C(Nc1ccc-2c(OCc3cnccc-23)c1)C1(CC1)C#N
: