Target
Fatty acid-binding protein, adipocyte
Ligand
BDBM263053
Substrate
Meas. Tech.
FABP Assay
pH
7.5±n/a
Temperature
298.15±n/a K
IC50
20.0±n/a nM
Comments
extracted
Citation
 Buettelmann, BCeccarelli, SMConte, AKuehne, HKuhn, BNeidhart, WSander, UORichter, H Urea derivatives and their use as fatty-acid binding protein (FABP) inhibitors US Patent  US9708340 Publication Date 7/18/2017 
Target
Name:
Fatty acid-binding protein, adipocyte
Synonyms:
A-FABP ALBP FABP4 Fatty acid binding protein adipocyte Fatty acid-binding protein 4 (FABP4)
Type:
Enzyme
Mol. Mass.:
14719.23
Organism:
Homo sapiens (Human)
Description:
P15090
Residue:
132
  
Inhibitor
Name:
BDBM263053
Synonyms:
US9708340, 30
Type:
Small organic molecule
Emp. Form.:
C17H14ClFN2O3
Mol. Mass.:
348.756
SMILES:
OC(=O)[C@H]1CCN1C(=O)Nc1cc(Cl)c(F)cc1-c1ccccc1
: