Target
Aurora kinase B
Ligand
BDBM26296
Substrate
Biotinylated Peptide Substrate
Meas. Tech.
Aurora B Kinase Inhibition Assay
pH
7.5±n/a
Temperature
295.15±n/a K
Ki
<1±n/a nM
Citation
 Mortlock, AAFoote, KMHeron, NMJung, FHPasquet, GLohmann, JJWarin, NRenaud, FDe Savi, CRoberts, NJJohnson, TDousson, CBHill, GBPerkins, DHatter, GWilkinson, RWWedge, SRHeaton, SPOdedra, RKeen, NJCrafter, CBrown, EThompson, KBrightwell, SKhatri, LBrady, MCKearney, SMcKillop, DRhead, SParry, TGreen, S Discovery, synthesis, and in vivo activity of a new class of pyrazoloquinazolines as selective inhibitors of aurora B kinase. J Med Chem 50:2213-24 (2007)  
Target
Name:
Aurora kinase B
Synonyms:
AIK2 AIM1 ARK2 AURKB_HUMAN Aurora B-INCENP Aurora kinase B (AURKB) STK-1 STK12 Serine/threonine-protein kinase aurora B
Type:
Protein
Mol. Mass.:
39327.72
Organism:
Homo sapiens (Human)
Description:
Q96GD4
Residue:
344
  
Inhibitor
Name:
BDBM26296
Synonyms:
CHEMBL216053 pyrazoloquinazoline deriv., 30
Type:
Small organic molecule
Emp. Form.:
C29H35F2N7O4
Mol. Mass.:
583.6295
SMILES:
COc1cc2c(Nc3cc(CC(=O)Nc4cccc(F)c4F)n[nH]3)ncnc2cc1OCCCN(CCO)CC(C)C
:
Substrate
Name:
Biotinylated Peptide Substrate
Synonyms:
Type:
Peptide
Mol. Mass.:
2374.22
Organism:
Description:
Residue:
20