Target
Aurora kinase A
Ligand
BDBM26287
Substrate
Biotinylated Peptide Substrate
Meas. Tech.
Aurora B Kinase Inhibition Assay
Temperature
298.15±n/a K
Ki
220±n/a nM
Comments
extracted
Citation
 Mortlock, AAFoote, KMHeron, NMJung, FHPasquet, GLohmann, JJWarin, NRenaud, FDe Savi, CRoberts, NJJohnson, TDousson, CBHill, GBPerkins, DHatter, GWilkinson, RWWedge, SRHeaton, SPOdedra, RKeen, NJCrafter, CBrown, EThompson, KBrightwell, SKhatri, LBrady, MCKearney, SMcKillop, DRhead, SParry, TGreen, S Discovery, synthesis, and in vivo activity of a new class of pyrazoloquinazolines as selective inhibitors of aurora B kinase. J Med Chem 50:2213-24 (2007)  
Target
Name:
Aurora kinase A
Synonyms:
AIK ARK1 AURKA AYK1 Aurora kinase A (AURA) Aurora kinase A (Aurora A) Aurora-related kinase 1 BTAK Breast-tumor-amplified kinase STK15 Serine/threonine kinase 15 Serine/threonine-protein kinase aurora A hARK1
Type:
Serine/threonine-protein kinase
Mol. Mass.:
45830.98
Organism:
Homo sapiens (Human)
Description:
O14965
Residue:
403
  
Inhibitor
Name:
BDBM26287
Synonyms:
N-(2,3-difluorophenyl)-2-[3-({7-[3-(4-hydroxypiperidin-1-yl)propoxy]-6-methoxyquinazolin-4-yl}amino)-1H-pyrazol-5-yl]acetamide | pyrazoloquinazoline deriv., 21
Type:
Small organic molecule
Emp. Form.:
C28H31F2N7O4
Mol. Mass.:
567.587
SMILES:
COc1cc2c(Nc3cc(CC(=O)Nc4cccc(F)c4F)n[nH]3)ncnc2cc1OCCCN1CCC(O)CC1
:
Substrate
Name:
Biotinylated Peptide Substrate
Synonyms:
Type:
Peptide
Mol. Mass.:
2374.22
Organism:
Description:
Residue:
20